{"text_format":"1","workbook":"xlsx","n_sheets":5,"sheets":["Bonds","Detail","WSJ","Weight","Notes"],"not_rendered":{"charts":0,"images":0,"macros":1,"external_links":0,"defined_names":19,"comments":0,"pivot_tables":0},"unopened":[],"bounds":{"document_bytes":16777216,"sheet_cells":100000,"rows_first":2000,"rows_last":500,"rows_between":2000,"halvings":0,"cell_chars":16384,"cell_head_chars":4096},"cells_cut":0,"cells_raw":0,"read":"whole","date_system":"1900"}

{"sheet":"Bonds","index":0,"n_rows":57,"n_cols":19,"rows_kept":57,"cut":false,"hidden":false,"merged":[]}
[]
[null,null,"2024-12-02","Settlement Date",null,null,null,null,"First Payment",null,null,null,null,null,null,"YTM Sensitivity"]
["Bond #","Lookup Key","Maturity","Coupon","Ask Price","Accrued Interest","Total Outlay","Date","Tot Days","Elap Days","Addit-ional Periods","YTM","Years to Mature","Macau-lay Duration","Modified Duration",0.01,0.02,0.03,"Comment"]
[1,{"$f":"TEXT(C4,\"yyyymmdd\")&TEXT(100000*D4,\"00000\")","v":"2025011500250"},{"$f":"INDEX(wsj_table,$A4,1)","v":"2025-01-15"},{"$f":"ROUND(INDEX(wsj_table,$A4,3)/100,5)","v":2.5000000000000001E-3},{"$f":"ROUND(INDEX(wsj_table,$A4,9),5)","v":99.59375},9.5108695652173919E-2,99.688858695652172,"2025-01-15",184,44,0,3.6846637725830078E-2,0.11956521739130435,0.11956521711796535,1.1740227752390991E-3,-1.1704669691005713E-3,-2.3338671930766709E-3,-3.4902796327702678E-3,"First 53 rows TIPS from WSJ"]
[2,{"$f":"TEXT(C5,\"yyyymmdd\")&TEXT(100000*D5,\"00000\")","v":"2025011502375"},{"$f":"INDEX(wsj_table,$A5,1)","v":"2025-01-15"},{"$f":"ROUND(INDEX(wsj_table,$A5,3)/100,5)","v":2.375E-2},{"$f":"ROUND(INDEX(wsj_table,$A5,9),5)","v":99.8125},0.90353260869565222,100.71603260869566,"2025-01-15",184,44,0,3.94439697265625E-2,0.11956521739130435,0.11956521847979569,1.1725276129633151E-3,-1.1689694574779051E-3,-2.3309014441033355E-3,-3.4858632405868431E-3]
[3,"2025041500125","2025-04-15",1.25E-3,99.0625,1.648351648351648E-2,99.078983516483518,"2025-04-15",182,134,0,2.701258659362793E-2,0.36813186813186816,0.3681318708668404,3.6322603352501319E-3,-3.6167662861573383E-3,-7.2028429257456599E-3,-1.0758631088498579E-2]
[4,"2025071500375","2025-07-15",3.7499999999999999E-3,99.125,0.14266304347826086,99.267663043478265,"2025-01-15",184,44,1,1.8012762069702148E-2,0.61956521739130432,0.61862282533967494,6.1310100408404422E-3,-6.0971800951176887E-3,-1.2127424225796093E-2,-1.8091787912670652E-2]
[5,"2025101500125","2025-10-15",1.25E-3,98.75,1.648351648351648E-2,98.766483516483518,"2025-04-15",182,134,1,1.5803992748260498E-2,0.86813186813186816,0.86781729377805583,8.6101356768810752E-3,-8.5520627384241561E-3,-1.698939930872858E-2,-2.5314100808045584E-2]
[6,"2026011500625","2026-01-15",6.2500000000000003E-3,98.53125,0.23777173913043478,98.769021739130437,"2025-01-15",184,44,2,1.9574791193008423E-2,1.1195652173913044,1.1148456307709391,1.1040399549772303E-2,-1.0952547058533447E-2,-2.1731806632516074E-2,-3.2341354078878989E-2]
[7,"2026011502000","2026-01-15",0.02,100,0.76086956521739135,100.76086956521739,"2025-01-15",184,44,2,1.9991785287857056E-2,1.1195652173913044,1.1047628389403039,1.0938290412729285E-2,-1.085141112189587E-2,-2.1531443855069738E-2,-3.2043633530462232E-2]
[8,"2026041500125","2026-04-15",1.25E-3,97.625,1.648351648351648E-2,97.641483516483518,"2025-04-15",182,134,2,1.8916577100753784E-2,1.3681318681318682,1.3671813351423725,1.3543713005771644E-2,-1.3419387106613466E-2,-2.659396413760521E-2,-3.9529363915485713E-2]
[9,"2026071500125","2026-07-15",1.25E-3,97.65625,4.755434782608696E-2,97.703804347826093,"2025-01-15",184,44,3,1.5966795384883881E-2,1.6195652173913044,1.6176598920373044,1.6048477541798643E-2,-1.5881237227913243E-2,-3.143370666039965E-2,-4.6665779484491722E-2]
[10,"2026101500125","2026-10-15",1.25E-3,97.3125,1.648351648351648E-2,97.328983516483518,"2025-04-15",182,134,3,1.5907719731330872E-2,1.8681318681318682,1.8662266681428825,1.8515000958393105E-2,-1.8299613793795751E-2,-3.617649197332385E-2,-5.3642408297382947E-2]
[11,"2027011500375","2027-01-15",3.7499999999999999E-3,97.15625,0.14266304347826086,97.298913043478265,"2025-01-15",184,44,4,1.7474472522735596E-2,2.1195652173913042,2.1100328929740018,2.0917567203073723E-2,-2.0649030722223322E-2,-4.0771855508500703E-2,-6.0384380522012344E-2]
[12,"2027011502375","2027-01-15",2.375E-2,101.28125,0.90353260869565222,102.18478260869566,"2025-01-15",184,44,4,1.7560869455337524E-2,2.1195652173913042,2.0620835539927662,2.0441351586576399E-2,-2.0180361653651058E-2,-3.98493116701438E-2,-5.9022255199952536E-2]
[13,"2027041500125","2027-04-15",1.25E-3,96.21875,1.648351648351648E-2,96.235233516483518,"2025-04-15",182,134,4,1.7622724175453186E-2,2.3681318681318682,2.3649335997159597,2.3442773233855629E-2,-2.3113323728311902E-2,-4.5582180677223839E-2,-6.7427567634943911E-2]
[14,"2027071500375","2027-07-15",3.7499999999999999E-3,96.90625,0.14266304347826086,97.048913043478265,"2025-01-15",184,44,5,1.5853308141231537E-2,2.6195652173913042,2.6052531812214856,2.5847646460185392E-2,-2.5452934679919076E-2,-5.0134969826140893E-2,-7.4073088544805835E-2]
[15,"2027101501625","2027-10-15",1.6250000000000001E-2,100,0.21428571428571425,100.21428571428571,"2025-04-15",182,134,5,1.6247712075710297E-2,2.8681318681318682,2.8083314022221133,2.7857007702004624E-2,-2.7400506982087396E-2,-5.3910863651503792E-2,-7.956422175980464E-2]
[16,"2028011500500","2028-01-15",5.0000000000000001E-3,96.25,0.19021739130434784,96.440217391304344,"2025-01-15",184,44,6,1.7401695251464844E-2,3.1195652173913042,3.0927897595757345,3.0661119863788208E-2,-3.0119627004465303E-2,-5.9185122342379319E-2,-8.7238319697384548E-2]
[17,"2028011501750","2028-01-15",1.7500000000000002E-2,100.0625,0.66576086956521741,100.72826086956522,"2025-01-15",184,44,6,1.7291069030761719E-2,3.1195652173913042,3.0298312633969076,3.0038612770467835E-2,-2.9510975360373434E-2,-5.799470247082255E-2,-8.5491844307212891E-2]
{"$rows_left_out":38}
{"sheet":"Detail","index":1,"n_rows":75,"n_cols":15,"rows_kept":75,"cut":false,"hidden":false,"merged":[]}
[54,"Bond #"]
[{"$f":"settle_date","v":"2024-12-02"},"Settlement Date",null,null,null,null,"Calculation of Macaulay Duration",null,null,null,"Calculation of YTM Sensitivity"]
[{"$f":"INDEX(Bonds!$A$4:$BB$320,$A$1,COLUMN(maturity))","v":"2026-12-02"},"Maturity Date"]
[{"$f":"INDEX(Bonds!$A$4:$BB$320,$A$1,COLUMN(coupon))","v":0.2},"Coupon",null,null,null,null,"Sum of Positive Discounted Cash Flows (V) -->",{"$f":"SUM(H$11:H$75)","v":130.4620008737887},null,null,null,{"$f":"SUM(L$11:L$75)","v":128.21497387760419},null,null,{"$f":"SUM(O$11:O$75)","v":126.01985228231267}]
[{"$f":"INDEX(Bonds!$A$4:$BB$320,$A$1,COLUMN(price))","v":130.46199999999999},"Price",null,null,null,null,null,"Sum of Time Weighted Cash Flows (MacCaulay Duration) -->",{"$f":"SUM(I$10:I$75)","v":1.7774892352222733},null,null,{"$f":"L4/$H$4-1","v":-1.7223612861482329E-2},null,null,{"$f":"O4/$H$4-1","v":-3.4049367338566561E-2}]
[{"$f":"INDEX(Bonds!$A$4:$BB$320,$A$1,COLUMN(nbr_per))","v":3},"# of Additional Periods"]
[null,"YTM - annualized",null,null,null,null,{"$f":"INDEX(Bonds!$A$4:$BB$320,$A$1,COLUMN(ytm))","v":3.9999246597290039E-2},null,null,null,{"$f":"INDEX(Bonds!$A$4:$BB$320,$A$1,COLUMN(ytm))+INDEX(ytm_sensitive,1,1)","v":4.9999246597290041E-2},null,null,{"$f":"INDEX(Bonds!$A$4:$BB$320,$A$1,COLUMN(ytm))+INDEX(ytm_sensitive,1,2)","v":5.9999246597290043E-2}]
[null,"YTM - per semi-annual period",null,null,null,null,{"$f":"G$7/2","v":1.999962329864502E-2},null,null,null,{"$f":"K$7/2","v":2.4999623298645021E-2},null,null,{"$f":"N$7/2","v":2.9999623298645021E-2}]
["Pmt #","Date","Principal","Interest","Total","Time in Periods (t)","Discount Factor","Present Value of Cash Flow (PV)","# Periods X PV / V",null,"Discount Factor","Present Value of Cash Flow (PV)",null,"Discount Factor","Present Value of Cash Flow (PV)"]
[0,{"$f":"$A$2","v":"2024-12-02"},{"$f":"-$A$5","v":-130.46199999999999},{"$f":"-INDEX(Bonds!$A$4:$BB$320,$A$1,COLUMN(accrued_int))","v":0},{"$f":"SUM(C10:D10)","v":-130.46199999999999},0,{"$f":"IF($E10=0,0,(1 + G$8)^$F10)","v":1},{"$f":"IF($G10=0,0,$E10/G10)","v":-130.46199999999999},{"$f":"($F10/2)*($H10/$H$4)","v":0},null,{"$f":"IF($E10=0,0,(1 + K$8)^$F10)","v":1},{"$f":"IF($G10=0,0,$E10/K10)","v":-130.46199999999999},null,{"$f":"IF($E10=0,0,(1 + N$8)^$F10)","v":1},{"$f":"IF($G10=0,0,$E10/N10)","v":-130.46199999999999}]
[1,{"$f":"INDEX(Bonds!$A$4:$BB$320,$A$1,COLUMN(first_date))","v":"2025-06-02"},{"$f":"IF($B11=$A$3,100,0)","v":0},{"$f":"IF($A11>0,100*($A$4/2),0)","v":10},{"$f":"SUM(C11:D11)","v":10},{"$f":"INDEX(Bonds!$A$4:$BB$320,$A$1,COLUMN(first_elap))/INDEX(Bonds!$A$4:$BB$320,$A$1,COLUMN(first_tot))","v":1},{"$f":"IF($E11=0,0,(1 + G$8)^$F11)","v":1.019999623298645},{"$f":"IF($G11=0,0,$E11/G11)","v":9.8039251893646107},3.7573872559447809E-2,null,{"$f":"IF($E11=0,0,(1 + K$8)^$F11)","v":1.0249996232986449},{"$f":"IF($G11=0,0,$E11/K11)","v":9.7561011464746556},null,{"$f":"IF($E11=0,0,(1 + N$8)^$F11)","v":1.029999623298645},{"$f":"IF($G11=0,0,$E11/N11)","v":9.7087414148505307}]
[{"$f":"IF(MAX($A$10:$A11)<=$A$6,$A11+1,0)","v":2},{"$f":"IF($A12>0,DATE(YEAR($B11+1),MONTH($B11+1)+6,DAY($B11+1))-1,\"\")","v":"2025-12-02"},{"$f":"IF($B12=$A$3,100,0)","v":0},{"$f":"IF($A12>0,100*($A$4/2),0)","v":10},10,{"$f":"IF($A12>0,$F11+1,0)","v":2},1.0403992315293777,9.6116949118657917,7.3674287129509228E-2,null,1.0506242277623641,9.5181509580244086,null,1.0608992239953507,9.4259659860433871]
[{"$f":"IF(MAX($A$10:$A12)<=$A$6,$A12+1,0)","v":3},{"$f":"IF($A13>0,DATE(YEAR($B12+1),MONTH($B12+1)+6,DAY($B12+1))-1,\"\")","v":"2026-06-02"},0,10,10,3,1.0612068242401651,9.4232337858928688,0.10834457990962146,null,1.0768894376848528,9.2860043473900777,null,1.0927258010730361,9.1514266343671853]
[{"$f":"IF(MAX($A$10:$A13)<=$A$6,$A13+1,0)","v":4},"2026-12-02",100,10,110,4,1.0824305609669198,101.62314698666542,1.5578964956236949,null,1.1038112679612639,99.654717425715049,null,1.1255071634739373,97.73371824705157]
[{"$f":"IF(MAX($A$10:$A14)<=$A$6,$A14+1,0)","v":0},"",0,0,0,0,0,0,0,null,0,0,null,0,0]
[{"$f":"IF(MAX($A$10:$A15)<=$A$6,$A15+1,0)","v":0},"",0,0,0,0,0,0,0,null,0,0,null,0,0]
[{"$f":"IF(MAX($A$10:$A16)<=$A$6,$A16+1,0)","v":0},"",0,0,0,0,0,0,0,null,0,0,null,0,0]
[{"$f":"IF(MAX($A$10:$A17)<=$A$6,$A17+1,0)","v":0},"",0,0,{"$f":"SUM(C18:D18)","v":0},{"$f":"IF($A18>0,$F17+1,0)","v":0},0,0,0,null,0,0,null,0,0]
[{"$f":"IF(MAX($A$10:$A18)<=$A$6,$A18+1,0)","v":0},"",0,0,0,0,0,0,0,null,0,0,null,0,0]
[{"$f":"IF(MAX($A$10:$A19)<=$A$6,$A19+1,0)","v":0},"",0,0,0,0,0,0,0,null,0,0,null,0,0]
{"$rows_left_out":56}
{"sheet":"WSJ","index":2,"n_rows":61,"n_cols":10,"rows_kept":61,"cut":false,"hidden":false,"merged":[[3,5,4,5],[3,6,4,6],[3,1,4,1],[3,2,4,2],[3,3,4,3],[3,4,4,4]]}
[null,"To update copy and paste from WSJ TIPS Web Page into the green cells"]
[null,"(http://online.wsj.com/mdc/public/page/2_3020-tips.html?mod=mdc_bnd_pglnk)"]
[]
[null,"Maturity","Coupon","Bid","Asked","Chg","Yield*","Accrued"]
["Mat Date",null,null,null,null,null,null,"principal","Ask Price"]
[{"$f":"DATE(VALUE(LEFT(TRIM($B6),4)),INT((SEARCH(TRIM(MID(TRIM($B6),5,4)),\"JanFebMarAprMayJunJulAugSepOctNovDec\")-1)/3)+1,VALUE(RIGHT(TRIM($B6),2)))","v":"2025-01-15"},"2025 Jan 15",0.25,99.19,99.19,1,3.6150000000000002,1331,{"$f":"INT($E6)+(100*MOD($E6,1))/32","v":99.59375}]
["2025-01-15","2025 Jan 15",2.375,99.26,99.26,1,3.9009999999999998,1672,99.812500000000014]
["2025-04-15","2025 Apr 15",0.125,99.02,99.02,2,2.69,1220,99.062499999999986]
["2025-07-15","2025 Jul 15",0.375,99.04,99.04,3,1.798,1329,99.125000000000014]
["2025-10-15","2025 Oct 15",0.125,98.23,98.24,4,1.5960000000000001,1215,98.749999999999986]
["2026-01-15","2026 Jan 15",0.625,98.16,98.17,2,1.96,1326,98.53125]
["2026-01-15","2026 Jan 15",2,99.32,100,1,1.9870000000000001,1588,100]
["2026-04-15","2026 Apr 15",0.125,97.19,97.2,6,1.8919999999999999,1202,97.625000000000014]
["2026-07-15","2026 Jul 15",0.125,97.21,97.21,2,1.589,1315,97.656249999999986]
["2026-10-15","2026 Oct 15",0.125,97.1,97.1,7,1.585,1153,97.312499999999986]
["2027-01-15","2027 Jan 15",0.375,97.05,97.05,7,1.74,1305,97.156249999999986]
["2027-01-15","2027 Jan 15",2.375,101.08,101.09,3,1.752,1563,101.28125000000001]
["2027-04-15","2027 Apr 15",0.125,96.06,96.07,7,1.7669999999999999,1116,96.218749999999972]
["2027-07-15","2027 Jul 15",0.375,96.28,96.29,3,1.5880000000000001,1288,96.906250000000014]
["2027-10-15","2027 Oct 15",1.625,99.3,99.32,4,1.63,1064,99.999999999999972]
{"$rows_left_out":42}
{"sheet":"Weight","index":3,"n_rows":81,"n_cols":26,"rows_kept":81,"cut":false,"hidden":false,"merged":[]}
[" ",null,null,null,null,315.31270999999998,{"$f":"\"<-- Reference CPI on \" & TEXT(settle_date,\"mm/dd/yyyy\")","v":"<-- Reference CPI on 12/02/2024"}]
[null,null,null,null,null,null,null,null,null,null,null,null,null,null,null,"YTM Sensitivity",null,null,null,"Weighted Product"]
["Lookup Key","Matures","Coupon","Years","Dated Date","Ref CPI on Dated Date","Face Value (000)","Index Ratio","Adjusted Value (000)","Price","Market Value (000)","YTM","Life","Mac Dur","Mod Dur",{"$f":"TEXT(INDEX([0]!ytm_sensitive,1,1),\"+0.0%;[red]-0.0%\")&\" Chg\"","v":"+1.0% Chg"},{"$f":"TEXT(INDEX([0]!ytm_sensitive,1,2),\"+0.0%;-0.0%\")&\" Chg\"","v":"+2.0% Chg"},{"$f":"TEXT(INDEX([0]!ytm_sensitive,1,3),\"+0.0%;-0.0%\")&\" Chg\"","v":"+3.0% Chg"},"Group","YTM","Life","Mac Dur","Mod Dur",{"$f":"TEXT(INDEX([0]!ytm_sensitive,1,1),\"+0.0%;-0.0%\")&\" Chg\"","v":"+1.0% Chg"},{"$f":"TEXT(INDEX([0]!ytm_sensitive,1,2),\"+0.0%;-0.0%\")&\" Chg\"","v":"+2.0% Chg"},{"$f":"TEXT(INDEX([0]!ytm_sensitive,1,3),\"+0.0%;-0.0%\")&\" Chg\"","v":"+3.0% Chg"}]
[{"$f":"TEXT(B4,\"yyyymmdd\")&TEXT(1000*C4,\"00000\")","v":"2025011502375"},"2025-01-15",2.375,20.5,"2004-07-15",188.49677,28000012,{"$f":"ROUND($F$1/$F4,5)","v":1.6727799999999999},{"$f":"$G4*$H4","v":46837860.073359996},{"$f":"VLOOKUP($A4,tips_tbl,4,FALSE)","v":99.8125},{"$f":"$I4*($J4/100)","v":46750039.085722446},{"$f":"VLOOKUP($A4,tips_tbl,11,FALSE)","v":3.94439697265625E-2},{"$f":"VLOOKUP($A4,tips_tbl,12,FALSE)","v":0.11956521739130435},{"$f":"VLOOKUP($A4,tips_tbl,13,FALSE)","v":0.11956521847979569},{"$f":"VLOOKUP($A4,tips_tbl,14,FALSE)","v":1.1725276129633151E-3},{"$f":"VLOOKUP($A4,tips_tbl,15,FALSE)","v":-1.1689694574779051E-3},{"$f":"VLOOKUP($A4,tips_tbl,16,FALSE)","v":-2.3309014441033355E-3},{"$f":"VLOOKUP($A4,tips_tbl,17,FALSE)","v":-3.4858632405868431E-3},{"$f":"IF($M4<=1,\"A\",IF($M4<=5,\"B\",IF($M4<=10,\"C\",IF($M4<=15,\"D\",IF($M4<=20,\"E\",\"F\")))))","v":"A"},{"$f":"$K4*L4","v":1844007.1264128499},5589678.5863363799,{"$f":"$K4*N4","v":5589678.6372233927},54815.711735123819,-54649.367827107824,-108969.73361679784,-162964.24274491801]
[{"$f":"TEXT(B5,\"yyyymmdd\")&TEXT(1000*C5,\"00000\")","v":"2025011500250"},"2025-01-15",0.25,10,"2015-01-15",236.85402999999999,41000014,1.33125,54581268.637500003,99.59375,54359532.233660161,3.6846637725830078E-2,0.11956521739130435,0.11956521711796535,1.1740227752390991E-3,-1.1704669691005713E-3,-2.3338671930766709E-3,-3.4902796327702678E-3,"A",{"$f":"$K5*L5","v":2002965.9911592586},6499509.2888071937,6499509.2739486126,63819.328893660968,-63626.03693525702,-126867.92891113325,-189729.96820206291]
["2025041500125","2025-04-15",0.125,5,"2020-04-15",258.30092999999999,35553007,1.22072,43400266.70504,99.0625,42993389.204680249,2.701258659362793E-2,0.36813186813186816,0.3681318708668404,3.6322603352501319E-3,-3.6167662861573383E-3,-7.2028429257456599E-3,-1.0758631088498579E-2,"A",1161362.6488449734,15827236.685239434,15827236.80282516,156163.18228613128,-155497.04060312838,-309674.62928676093,-462550.01369739213]
["2025071500375","2025-07-15",0.375,10,"2015-07-15",237.14365000000001,41000021,1.3296300000000001,54514857.922230005,99.125,54037852.915410489,1.8012762069702148E-2,0.61956521739130432,0.61862282533967494,6.1310100408404422E-3,-6.0971800951176887E-3,-1.2127424225796093E-2,-1.8091787912670652E-2,"A",973370.98732284969,33479974.088895626,33429049.245821029,331306.6188098407,-329478.52117873821,-655339.96655635524,-977641.37420169811]
[{"$f":"TEXT(B8,\"yyyymmdd\")&TEXT(1000*C8,\"00000\")","v":"2025101500125"},"2025-10-15",0.125,5,"2020-10-15",259.46996999999999,34282307,1.21522,41660545.112539999,98.75,41139788.298633248,1.5803992748260498E-2,0.86813186813186816,0.86781729377805583,8.6101356768810752E-3,-8.5520627384241561E-3,-1.698939930872858E-2,-2.5314100808045584E-2,"A",650172.9159365719,35714761.27024205,35701819.747922033,354219.15896939673,-351830.05057539948,-698940.29088203982,-1041416.7482132561]
["2026011502000","2026-01-15",2,20,"2006-01-15",198.47742,20000008,1.58866,31773212.709279999,100,31773212.709279999,1.9991785287857056E-2,1.1195652173913044,1.1047628389403039,1.0938290412729285E-2,-1.085141112189587E-2,-2.1531443855069738E-2,-3.2043633530462232E-2,"B",{"$f":"$K9*L9","v":635203.24638933665},{"$f":"$K9*M9","v":35572183.79408522},{"$f":"$K9*N9","v":35101864.674958318},347544.62795952568,-344784.19377184421,-684123.1455450505,{"$f":"$K9*R9","v":-1018129.1841415933}]
[{"$f":"TEXT(B10,\"yyyymmdd\")&TEXT(1000*C10,\"00000\")","v":"2026011500625"},"2026-01-15",0.625,10,"2016-01-15",237.61129,42426146,1.32701,56299920.003459997,98.53125,55473014.928409182,1.9574791193008423E-2,1.1195652173913044,1.1148456307709391,1.1040399549772303E-2,-1.0952547058533447E-2,-2.1731806632516074E-2,-3.2341354078878989E-2,"B",{"$f":"$K10*L10","v":1085872.6840702489},{"$f":"$K10*M10","v":62105658.017675504},61843848.318628058,612444.24904012098,-607570.80648212996,-1205528.8337468659,{"$f":"$K10*R10","v":-1794072.4176226214}]
[{"$f":"TEXT(B11,\"yyyymmdd\")&TEXT(1000*C11,\"00000\")","v":"2026041500125"},"2026-04-15",0.125,5,"2021-04-15",262.25027,39866366,1.20234,47932926.496440001,97.625,46794519.492149547,1.8916577100753784E-2,1.3681318681318682,1.3671813351423725,1.3543713005771644E-2,-1.3419387106613466E-2,-2.659396413760521E-2,-3.9529363915485713E-2,"B",{"$f":"$K11*L11","v":885192.13586597273},{"$f":"$K11*M11","v":64021073.37112768},63976593.636622794,633771.54224466055,-627953.77153312415,-1244451.7732106929,{"$f":"$K11*R11","v":-1849757.5902554691}]
[{"$f":"TEXT(B12,\"yyyymmdd\")&TEXT(1000*C12,\"00000\")","v":"2026071500125"},"2026-07-15",0.125,10,"2016-07-15",239.70132000000001,36841337,1.3154399999999999,48462568.343279995,97.65625,47326726.897734374,1.5966795384883881E-2,1.6195652173913044,1.6176598920373044,1.6048477541798643E-2,-1.5881237227913243E-2,-3.143370666039965E-2,-4.6665779484491722E-2,"B",755656.164612405,76648720.736548066,76558547.923867986,759521.91374512785,-751606.9770835822,-1487654.4505002282,-2208538.6011324353]
[{"$f":"TEXT(B13,\"yyyymmdd\")&TEXT(1000*C13,\"00000\")","v":"2026101500125"},"2026-10-15",0.125,5,"2021-10-15",273.25770999999997,38309759,1.1538999999999999,44205630.910099998,97.3125,43017604.579391062,1.5907719731330872E-2,1.8681318681318682,1.8662266681428825,1.8515000958393105E-2,-1.8299613793795751E-2,-3.617649197332385E-2,-5.3642408297382947E-2,"B",{"$f":"$K13*L13","v":684311.9971621685},80362558.005455837,80280600.865684986,796470.99001520115,-787205.55013707594,-1556226.0267779601,-2307567.9088230659]
["2027011502375","2027-01-15",2.375,20,"2007-01-15",201.66452000000001,16482433,1.56355,25771108.117150001,101.28125,26101300.439900983,1.7560869455337524E-2,2.1195652173913042,2.0620835539927662,2.0441351586576399E-2,-2.0180361653651058E-2,-3.98493116701438E-2,-5.9022255199952536E-2,"B",{"$f":"$K14*L14","v":458361.52963964507},55323408.541094474,{"$f":"$K14*N14","v":53823062.374943972},533545.85915887717,-526733.68250780331,-1040118.8562256758,{"$f":"$K14*R14","v":-1540557.6156144692}]
[{"$f":"TEXT(B15,\"yyyymmdd\")&TEXT(1000*C15,\"00000\")","v":"2027011500375"},"2027-01-15",0.375,10,"2017-01-15",241.55919,38479618,1.30532,50228214.967760004,97.15625,48799850.104614332,1.7474472522735596E-2,2.1195652173913042,2.1100328929740018,2.0917567203073723E-2,-2.0649030722223322E-2,-4.0771855508500703E-2,-6.0384380522012344E-2,"B",852751.63976669894,103434464.89564994,{"$f":"$K15*N15","v":102969288.89293702},{"$f":"$K15*O15","v":1020774.1440631945},{"$f":"$K15*P15","v":-1007669.6040500744},{"$f":"$K15*Q15","v":-1989660.4373018285},{"$f":"$K15*R15","v":-2946748.7181341955}]
[{"$f":"TEXT(B16,\"yyyymmdd\")&TEXT(1000*C16,\"00000\")","v":"2027041500125"},"2027-04-15",0.125,5,"2022-04-15",282.34640000000002,39375932,{"$f":"ROUND($F$1/$F16,5)","v":1.11676},{"$f":"$G16*$H16","v":43973465.820320003},{"$f":"VLOOKUP($A16,tips_tbl,4,FALSE)","v":96.21875},{"$f":"$I16*($J16/100)","v":42310719.143989153},{"$f":"VLOOKUP($A16,tips_tbl,11,FALSE)","v":1.7622724175453186E-2},{"$f":"VLOOKUP($A16,tips_tbl,12,FALSE)","v":2.3681318681318682},{"$f":"VLOOKUP($A16,tips_tbl,13,FALSE)","v":2.3649335997159597},{"$f":"VLOOKUP($A16,tips_tbl,14,FALSE)","v":2.3442773233855629E-2},{"$f":"VLOOKUP($A16,tips_tbl,15,FALSE)","v":-2.3113323728311902E-2},{"$f":"VLOOKUP($A16,tips_tbl,16,FALSE)","v":-4.5582180677223839E-2},{"$f":"VLOOKUP($A16,tips_tbl,17,FALSE)","v":-6.7427567634943911E-2},{"$f":"IF($M16<=1,\"A\",IF($M16<=5,\"B\",IF($M16<=10,\"C\",IF($M16<=15,\"D\",IF($M16<=20,\"E\",\"F\")))))","v":"B"},{"$f":"$K16*L16","v":745630.13313958759},100197362.36845782,100062041.33176523,991880.59425389185,-977941.34875270515,-1928614.8446045872,{"$f":"$K16*R16","v":-2852908.8767644446}]
[{"$f":"TEXT(B17,\"yyyymmdd\")&TEXT(1000*C17,\"00000\")","v":"2027071500375"},"2027-07-15",0.375,10,"2017-07-15",244.61839000000001,36918699,1.2889999999999999,47588203.011,96.90625,46115942.980347186,1.5853308141231537E-2,2.6195652173913042,2.6052531812214856,2.5847646460185392E-2,-2.5452934679919076E-2,-5.0134969826140893E-2,-7.4073088544805835E-2,"B",731090.25429090741,120803720.19851817,120143707.15457815,1191988.5903340823,-1173786.0843816495,-2312021.4098237399,{"$f":"$K17*R17","v":-3415950.3277104744}]
[{"$f":"TEXT(B18,\"yyyymmdd\")&TEXT(1000*C18,\"00000\")","v":"2027101501625"},"2027-10-15",1.625,5,"2027-10-15",296.22858000000002,40000000,1.0644199999999999,42576800,100,42576800,1.6247712075710297E-2,2.8681318681318682,2.8083314022221133,2.7857007702004624E-2,-2.7400506982087396E-2,-5.3910863651503792E-2,-7.956422175980464E-2,"B",{"$f":"$K18*L18","v":691775.58750510216},122115876.92307693,119569764.44613047,1186062.2455267105,-1166625.9056749386,-2295352.0595173468,-3387589.9570228504]
["2028011501750","2028-01-15",1.75,20,"2008-01-15",209.49645000000001,15635247,1.5051000000000001,23532610.2597,100.0625,23547318.141112316,1.7291069030761719E-2,3.1195652173913042,3.0298312633969076,3.0038612770467835E-2,-2.9510975360373434E-2,-5.799470247082255E-2,-8.5491844307212891E-2,"B",{"$f":"$K19*L19","v":407158.30346728076},73457394.635861248,71344400.673095256,707328.77142388537,-694904.32546523993,-1365619.7095796112,-2013103.6563723839]
[{"$f":"TEXT(B20,\"yyyymmdd\")&TEXT(1000*C20,\"00000\")","v":"2028011500500"},"2028-01-15",0.5,10,"2018-01-15",246.66570999999999,38821511,1.2783,49625537.511299998,96.25,47764579.854626246,1.7401695251464844E-2,3.1195652173913042,3.0927897595757345,3.0661119863788208E-2,-3.0119627004465303E-2,-5.9185122342379319E-2,-8.7238319697384548E-2,"B",{"$f":"$K20*L20","v":831184.66244446288},149004721.93780142,147725803.44482547,1464515.5081661788,-1438651.3292463401,-2826952.502328401,-4166901.6875691381]
{"$rows_left_out":62}
{"sheet":"Notes","index":4,"n_rows":244,"n_cols":7,"rows_kept":244,"cut":false,"hidden":false,"merged":[]}
["2011-06-25","Bob Hinkley"]
[]
[null,"Excel workbook with macro to calculate yield to maturity and duration for one or more bonds"]
[]
[]
[]
[]
[]
[]
[null,"Refer to following article in Wikipedia for explanation of MacCaulay and Modified Duration:"]
[null,null,"http://en.wikipedia.org/wiki/Bond_duration"]
[]
[null,"Bonds sheet instructions"]
[null,null,1,"Enter the \"Settlement\" date which is the date bonds are assumed to be purchased,"]
[null,null,2,"Fill in the following 3 cells for one or more rows beginning with row 4"]
[null,null,null,null,"Maturity"]
[null,null,null,null,"Coupon"]
[null,null,null,null,"Price "]
[null,null,3,"Click the [Calc YTM & Duration] button to run the macro"]
[null,null,null,null,"All the other columns will be filled in"]
{"$rows_left_out":224}