{"text_format":"1","workbook":"xlsx","n_sheets":5,"sheets":["Rates","Portfolio","Mature","MatYrs","Notes"],"not_rendered":{"charts":0,"images":0,"macros":1,"external_links":0,"defined_names":7,"comments":0,"pivot_tables":0},"unopened":[],"bounds":{"document_bytes":16777216,"sheet_cells":100000,"rows_first":2000,"rows_last":500,"rows_between":2000,"halvings":0,"cell_chars":16384,"cell_head_chars":4096},"cells_cut":0,"cells_raw":0,"read":"whole","date_system":"1900"}

{"sheet":"Rates","index":0,"n_rows":62,"n_cols":6,"rows_kept":62,"cut":false,"hidden":false,"merged":[]}
["Effective Date","Ready","Fixed Rate","Inflation Rate"]
["1998-09-01",true,3.4000000000000002E-2,6.1999999999999998E-3,false,"<-- display redemption value (enter TRUE or FALSE)"]
["1998-11-01",true,3.3000000000000002E-2,8.6E-3]
["1999-05-01",true,3.3000000000000002E-2,8.6E-3]
["1999-11-01",true,3.4000000000000002E-2,1.7600000000000001E-2]
["2000-05-01",true,3.5999999999999997E-2,1.9099999999999999E-2]
["2000-11-01",true,3.4000000000000002E-2,1.52E-2]
["2001-05-01",true,0.03,1.44E-2]
["2001-11-01",true,0.02,1.1900000000000001E-2]
["2002-05-01",true,0.02,2.8E-3]
["2002-11-01",true,1.6E-2,1.23E-2]
["2003-05-01",true,1.0999999999999999E-2,1.77E-2]
["2003-11-01",true,1.0999999999999999E-2,5.4000000000000003E-3]
["2004-05-01",true,0.01,1.1900000000000001E-2]
["2004-11-01",true,0.01,1.3299999999999999E-2]
{"$rows_left_out":48}
{"sheet":"Portfolio","index":1,"n_rows":59,"n_cols":20,"rows_kept":59,"cut":false,"hidden":false,"merged":[]}
[null,{"$f":"IF(disp_redemp, \"Redemption\", \"Full\")& \" Value\"","v":"Full Value"},2025,{"$f":"DATE($C$1-1,12,1)","v":"2024-12-01"},{"$f":"DATE($C$1,1,1)","v":"2025-01-01"},{"$f":"DATE($C$1,2,1)","v":"2025-02-01"},{"$f":"DATE($C$1,3,1)","v":"2025-03-01"},{"$f":"DATE($C$1,4,1)","v":"2025-04-01"},{"$f":"DATE($C$1,5,1)","v":"2025-05-01"},{"$f":"DATE($C$1,6,1)","v":"2025-06-01"},{"$f":"DATE($C$1,7,1)","v":"2025-07-01"},{"$f":"DATE($C$1,8,1)","v":"2025-08-01"},{"$f":"DATE($C$1,9,1)","v":"2025-09-01"},{"$f":"DATE($C$1,10,1)","v":"2025-10-01"},{"$f":"DATE($C$1,11,1)","v":"2025-11-01"},{"$f":"DATE($C$1,12,1)","v":"2025-12-01"},{"$f":"DATE($C$1+1,1,1)","v":"2026-01-01"},"Click for Value Web Page","Dec vs Dec","Jan vs Jan"]
[null,{"$f":"SUM(B$5:B$1000)","v":550000},null,{"$f":"SUM(D$5:D$1000)","v":1041912},{"$f":"SUM(E$5:E$1000)","v":1044860},1047824,1050808,1053744,1066668,1070444,1074272,1078092,1081912,1085784,1089708,{"$f":"SUM(P$5:P$1000)","v":1089964},1090224,"Total Value",{"$f":"SUM(S$5:S$1000)","v":38052},{"$f":"SUM(T$5:T$1000)","v":35364}]
["Purchase",null,null,{"$f":"D$2-SUMIF(D$5:D$1000,\">0\",$B$5:$B$1000)","v":501912},{"$f":"E$2-SUMIF(E$5:E$1000,\">0\",$B$5:$B$1000)","v":504860},507824,510808,513744,516668,520444,524272,528092,531912,535784,539708,{"$f":"P$2-SUMIF(P$5:P$1000,\">0\",$B$5:$B$1000)","v":539964},540224,"Total Interest"]
["Date","Amount","Fixed",null,{"$f":"E$3-D$3","v":2948},{"$f":"F$3-E$3","v":2964},2984,2936,2924,3776,3828,3820,3820,3872,3924,256,260,"Month's Interest"]
["1998-09-01",10000,{"$f":"IF(ISNUMBER($A5),VLOOKUP($A5,rate_tbl,3,TRUE),\"\")","v":3.4000000000000002E-2},47112,47360,47612,47864,48076,48284,48496,48712,48924,49140,49396,49652,49908,50168,"09-1998 history ",{"$f":"IF(ISNUMBER(P5), P5-MAX($B5,D5),0)","v":2796},2808]
["1998-11-01",10000,3.3000000000000002E-2,45892,46092,46288,46488,46688,46892,47132,47372,47616,47856,48104,48348,48348,48348,"11-1998 history ",2456,2256]
["1999-05-01",10000,3.3000000000000002E-2,44748,44940,45136,45328,45524,45720,45952,46188,46424,46660,46900,47140,47140,47140,"05-1999 history ",2392,2200]
["1999-11-01",10000,3.4000000000000002E-2,44668,44864,45060,45260,45456,45656,45892,46132,46372,46612,46852,47096,47096,47096,"11-1999 history ",2428,2232]
["2000-05-01",10000,3.5999999999999997E-2,45272,45480,45688,45896,46104,46316,46564,46812,47064,47316,47568,47824,47824,47824,"05-2000 history ",2552,2344]
["2000-11-01",10000,3.4000000000000002E-2,41664,41844,42028,42212,42400,42584,42804,43028,43252,43476,43700,43928,43928,43928,"11-2000 history ",2264,2084]
["2001-05-01",10000,0.03,36836,36988,37136,37288,37440,37592,37776,37960,38144,38328,38512,38700,38700,38700,"05-2001 history ",{"$f":"IF(ISNUMBER(P11), P11-MAX($B11,D11),0)","v":1864},{"$f":"IF(ISNUMBER(Q11), Q11-MAX($B11,E11),0)","v":1712}]
["2001-11-01",10000,0.02,28628,28720,28816,28908,29000,29096,29212,29332,29448,29568,29688,29808,29808,29808,"11-2001 history ",1180,1088]
["2002-05-01",10000,0.02,28016,28104,28196,28288,28380,28472,28588,28704,28816,28936,29052,29168,29168,29168,"05-2002 history ",1152,1064]
["2002-11-01",10000,1.6E-2,25396,25472,25544,25620,25696,25768,25864,25960,26056,26152,26248,26344,26344,26344,"11-2002 history ",948,872]
["2003-05-01",10000,1.0999999999999999E-2,22492,22548,22604,22660,22716,22772,22848,22924,22996,23072,23148,23224,23224,23224,"05-2003 history ",732,676]
{"$rows_left_out":45}
{"sheet":"Mature","index":2,"n_rows":63,"n_cols":13,"rows_kept":63,"cut":false,"hidden":false,"merged":[]}
["                                                                                                              "]
["m/yyyy;;","###,##0;;","#0.0%","###,##0.00;;","m/yyyy;;","m/yyyy;;","###0;;","#0.0;;","#0.00%;;",{"$f":"$B2","v":"###,##0;;"},{"$f":"$B2","v":"###,##0;;"}]
[12,9,7,14,8,9,6,7,7,11,11]
["Last rates",{"$f":"INDEX(Rates!A:A,MATCH(FALSE,Rates!B:B,0)-1,0)","v":"2025-05-01"},null,null,null,null,null,null,null,null,null,null,{"$f":"RIGHT(\"   \"&ROW(A4),3)&RIGHT(A$1&A4,A$3)&RIGHT(A$1&TEXT(B4,A2),B$3)","v":"  4  Last rates   5/2025"}]
["Future CPI",0.02,"<-- Enter future inflation assumption",null,null,null,null,null,null,null,null,null,{"$f":"RIGHT(\"   \"&ROW(A5),3)&RIGHT(A$1&A5,A$3)&RIGHT(A$1&TEXT(B5,C$2),B$3)","v":"  5  Future CPI     2.0%"}]
[null,"Face","Fixed","Now",null,null,null,"Remain","Comp","Grows",null,null,{"$f":"RIGHT(\"   \"&ROW(A6),3)&RIGHT(A$1&A6,A$3)&RIGHT(A$1&B6,B$3)&RIGHT(A$1&C6,C$3)&RIGHT(A$1&D6,D$3)&RIGHT(A$1&E6,E$3)&RIGHT(A$1&F6,F$3)&RIGHT(A$1&G6,G$3)&RIGHT(A$1&H6,H$3)&RIGHT(A$1&I6,I$3)&RIGHT(A$1&J6,J$3)&RIGHT(A$1&K6,K$3)","v":"  6                 Face  Fixed           Now                        Remain   Comp      Grows           "}]
["Bought","Value","Rate","Worth","As of","Matures","Year","Life","Rate","To","Gain",null,{"$f":"RIGHT(\"   \"&ROW(A7),3)&RIGHT(A$1&A7,A$3)&RIGHT(A$1&B7,B$3)&RIGHT(A$1&C7,C$3)&RIGHT(A$1&D7,D$3)&RIGHT(A$1&E7,E$3)&RIGHT(A$1&F7,F$3)&RIGHT(A$1&G7,G$3)&RIGHT(A$1&H7,H$3)&RIGHT(A$1&I7,I$3)&RIGHT(A$1&J7,J$3)&RIGHT(A$1&K7,K$3)","v":"  7      Bought    Value   Rate         Worth   As of  Matures  Year   Life   Rate         To       Gain"}]
["Sum",{"$f":"SUM(B9:B1000)","v":550000},null,{"$f":"SUM(D9:D1000)","v":1089964},null,null,null,null,null,{"$f":"SUM(J9:J1000)","v":1556987},{"$f":"J8-B8","v":1006987},null,{"$f":"RIGHT(\"   \"&ROW(A8),3)&RIGHT(A$1&TEXT(A8,A$2),A$3)&RIGHT(A$1&TEXT(B8,B$2),B$3)&RIGHT(A$1&TEXT(D8,D$2),C$3+D$3)&RIGHT(A$1&TEXT(J8,J$2),E$3+F$3+G$3+H$3+I$3+J$3)&RIGHT(A$1&TEXT(K8,K$2),K$3)","v":"  8         Sum  550,000         1,089,964.00                                       1,556,987  1,006,987"}]
[{"$f":"IF(ISNUMBER(Portfolio!A5),Portfolio!A5,\"\")","v":"1998-09-01"},{"$f":"IF(ISNUMBER(Portfolio!B5),Portfolio!B5,\"\")","v":10000},{"$f":"IF(ISNUMBER(Portfolio!C5),Portfolio!C5,\"\")","v":3.4000000000000002E-2},{"$f":"IF(ISNUMBER(Portfolio!P5),Portfolio!P5,\"\")","v":49908},{"$f":"IF(ISNUMBER(A9),DATE(YEAR(B$4),MONTH(B$4)+6+MOD(MONTH(A9),6)-MOD(MONTH(B$4),6)+IF(MOD(MONTH(A9),6)<5,6,0),DAY(B$4)),\"\")","v":"2026-03-01"},{"$f":"IF(ISNUMBER(A9),DATE(YEAR(A9)+30,MONTH(A9),DAY(A9)),\"\")","v":"2028-09-01"},{"$f":"IF(ISNUMBER(A9),YEAR(F9),\"\")","v":2028},{"$f":"IF(ISNUMBER(A9),YEAR(F9)-YEAR(E9)+(MONTH(F9)-MONTH(E9))/12,\"\")","v":2.5},{"$f":"IF(ISNUMBER(A9),ROUND(C9+B$5+C9*(B$5/2),4),\"\")","v":5.4300000000000001E-2},{"$f":"IF(ISNUMBER(A9),ROUND(D9*(1+I9/2)^(H9*2),0),\"\")","v":57061},{"$f":"IF(ISNUMBER(A9),J9-B9,\"\")","v":47061},null,{"$f":"RIGHT(\"   \"&ROW(A9),3)&RIGHT(A$1&TEXT(A9,A$2),A$3)&RIGHT(A$1&TEXT(B9,B$2),B$3)&RIGHT(A$1&TEXT(C9,C$2),C$3)&RIGHT(A$1&TEXT(D9,D$2),D$3)&RIGHT(A$1&TEXT(E9,E$2),E$3)&RIGHT(A$1&TEXT(F9,F$2),F$3)&RIGHT(A$1&TEXT(G9,G$2),G$3)&RIGHT(A$1&TEXT(H9,H$2),H$3)&RIGHT(A$1&TEXT(I9,I$2),I$3)&RIGHT(A$1&TEXT(J9,J$2),J$3)&RIGHT(A$1&TEXT(K9,K$2),K$3)","v":"  9      9/1998   10,000   3.4%     49,908.00  3/2026   9/2028  2028    2.5  5.43%     57,061     47,061"}]
[{"$f":"IF(ISNUMBER(Portfolio!A6),Portfolio!A6,\"\")","v":"1998-11-01"},{"$f":"IF(ISNUMBER(Portfolio!B6),Portfolio!B6,\"\")","v":10000},{"$f":"IF(ISNUMBER(Portfolio!C6),Portfolio!C6,\"\")","v":3.3000000000000002E-2},{"$f":"IF(ISNUMBER(Portfolio!P6),Portfolio!P6,\"\")","v":48348},{"$f":"IF(ISNUMBER(A10),DATE(YEAR(B$4),MONTH(B$4)+6+MOD(MONTH(A10),6)-MOD(MONTH(B$4),6)+IF(MOD(MONTH(A10),6)<5,6,0),DAY(B$4)),\"\")","v":"2025-11-01"},{"$f":"IF(ISNUMBER(A10),DATE(YEAR(A10)+30,MONTH(A10),DAY(A10)),\"\")","v":"2028-11-01"},{"$f":"IF(ISNUMBER(A10),YEAR(F10),\"\")","v":2028},{"$f":"IF(ISNUMBER(A10),YEAR(F10)-YEAR(E10)+(MONTH(F10)-MONTH(E10))/12,\"\")","v":3},{"$f":"IF(ISNUMBER(A10),ROUND(C10+B$5+C10*(B$5/2),4),\"\")","v":5.33E-2},{"$f":"IF(ISNUMBER(A10),ROUND(D10*(1+I10/2)^(H10*2),0),\"\")","v":56613},{"$f":"IF(ISNUMBER(A10),J10-B10,\"\")","v":46613},null,{"$f":"RIGHT(\"   \"&ROW(A10),3)&RIGHT(A$1&TEXT(A10,A$2),A$3)&RIGHT(A$1&TEXT(B10,B$2),B$3)&RIGHT(A$1&TEXT(C10,C$2),C$3)&RIGHT(A$1&TEXT(D10,D$2),D$3)&RIGHT(A$1&TEXT(E10,E$2),E$3)&RIGHT(A$1&TEXT(F10,F$2),F$3)&RIGHT(A$1&TEXT(G10,G$2),G$3)&RIGHT(A$1&TEXT(H10,H$2),H$3)&RIGHT(A$1&TEXT(I10,I$2),I$3)&RIGHT(A$1&TEXT(J10,J$2),J$3)&RIGHT(A$1&TEXT(K10,K$2),K$3)","v":" 10     11/1998   10,000   3.3%     48,348.00 11/2025  11/2028  2028    3.0  5.33%     56,613     46,613"}]
[{"$f":"IF(ISNUMBER(Portfolio!A7),Portfolio!A7,\"\")","v":"1999-05-01"},{"$f":"IF(ISNUMBER(Portfolio!B7),Portfolio!B7,\"\")","v":10000},{"$f":"IF(ISNUMBER(Portfolio!C7),Portfolio!C7,\"\")","v":3.3000000000000002E-2},{"$f":"IF(ISNUMBER(Portfolio!P7),Portfolio!P7,\"\")","v":47140},"2025-11-01","2029-05-01",2029,3.5,5.33E-2,56669,46669,null," 11      5/1999   10,000   3.3%     47,140.00 11/2025   5/2029  2029    3.5  5.33%     56,669     46,669"]
[{"$f":"IF(ISNUMBER(Portfolio!A8),Portfolio!A8,\"\")","v":"1999-11-01"},{"$f":"IF(ISNUMBER(Portfolio!B8),Portfolio!B8,\"\")","v":10000},{"$f":"IF(ISNUMBER(Portfolio!C8),Portfolio!C8,\"\")","v":3.4000000000000002E-2},{"$f":"IF(ISNUMBER(Portfolio!P8),Portfolio!P8,\"\")","v":47096},"2025-11-01","2029-11-01",2029,4,5.4300000000000001E-2,58352,48352,null," 12     11/1999   10,000   3.4%     47,096.00 11/2025  11/2029  2029    4.0  5.43%     58,352     48,352"]
[{"$f":"IF(ISNUMBER(Portfolio!A9),Portfolio!A9,\"\")","v":"2000-05-01"},{"$f":"IF(ISNUMBER(Portfolio!B9),Portfolio!B9,\"\")","v":10000},{"$f":"IF(ISNUMBER(Portfolio!C9),Portfolio!C9,\"\")","v":3.5999999999999997E-2},{"$f":"IF(ISNUMBER(Portfolio!P9),Portfolio!P9,\"\")","v":47824},"2025-11-01","2030-05-01",2030,4.5,5.6399999999999999E-2,61425,51425,null," 13      5/2000   10,000   3.6%     47,824.00 11/2025   5/2030  2030    4.5  5.64%     61,425     51,425"]
[{"$f":"IF(ISNUMBER(Portfolio!A10),Portfolio!A10,\"\")","v":"2000-11-01"},{"$f":"IF(ISNUMBER(Portfolio!B10),Portfolio!B10,\"\")","v":10000},{"$f":"IF(ISNUMBER(Portfolio!C10),Portfolio!C10,\"\")","v":3.4000000000000002E-2},{"$f":"IF(ISNUMBER(Portfolio!P10),Portfolio!P10,\"\")","v":43928},"2025-11-01","2030-11-01",2030,5,5.4300000000000001E-2,57422,47422,null," 14     11/2000   10,000   3.4%     43,928.00 11/2025  11/2030  2030    5.0  5.43%     57,422     47,422"]
[{"$f":"IF(ISNUMBER(Portfolio!A11),Portfolio!A11,\"\")","v":"2001-05-01"},{"$f":"IF(ISNUMBER(Portfolio!B11),Portfolio!B11,\"\")","v":10000},{"$f":"IF(ISNUMBER(Portfolio!C11),Portfolio!C11,\"\")","v":0.03},{"$f":"IF(ISNUMBER(Portfolio!P11),Portfolio!P11,\"\")","v":38700},"2025-11-01","2031-05-01",2031,5.5,5.0299999999999997E-2,50860,40860,null," 15      5/2001   10,000   3.0%     38,700.00 11/2025   5/2031  2031    5.5  5.03%     50,860     40,860"]
{"$rows_left_out":49}
{"sheet":"MatYrs","index":3,"n_rows":43,"n_cols":7,"rows_kept":43,"cut":false,"hidden":false,"merged":[]}
["                    ",9,14,11,11]
[null,"Face","Now","Grows",null,null,{"$f":"RIGHT(\"   \"&ROW(A2),3)&RIGHT(A$1&A2,7)&RIGHT(A$1&B2,B$1)&RIGHT(A$1&C2,C$1)&RIGHT(A$1&D2,D$1)&RIGHT(A$1&E2,E$1)","v":"  2            Face           Now      Grows           "}]
["Year","Value","Worth","To","Gain",null,{"$f":"RIGHT(\"   \"&ROW(A3),3)&RIGHT(A$1&A3,7)&RIGHT(A$1&B3,B$1)&RIGHT(A$1&C3,C$1)&RIGHT(A$1&D3,D$1)&RIGHT(A$1&E3,E$1)","v":"  3   Year    Value         Worth         To       Gain"}]
["Sum",{"$f":"SUM(B5:B100)","v":550000},{"$f":"SUM(C5:C100)","v":1089964},{"$f":"SUM(D5:D100)","v":1556987},{"$f":"SUM(E5:E100)","v":1006987},null,{"$f":"RIGHT(\"   \"&ROW(A4),3)&RIGHT(A$1&A4,7)&IF(B4=0,\"\",RIGHT(A$1&TEXT(B4,\"#,###,##0\"),B$1)&RIGHT(A$1&TEXT(C4,\"#,###,##0.00\"),C$1)&RIGHT(A$1&TEXT(D4,\"#,###,##0\"),D$1)&RIGHT(A$1&TEXT(E4,\"#,###,##0\"),E$1))","v":"  4    Sum  550,000  1,089,964.00  1,556,987  1,006,987"}]
[{"$f":"YEAR(MIN(Portfolio!A5:A1000))+30","v":2028},{"$f":"IF(ISNUMBER($A5),SUMIF(Mature!$G$5:G$1000,$A5,Mature!B$5:B$1000),\"\")","v":20000},{"$f":"IF(ISNUMBER($A5),SUMIF(Mature!$G$5:I$1000,$A5,Mature!D$5:D$1000),\"\")","v":98256},{"$f":"IF(ISNUMBER($A5),SUMIF(Mature!$G$5:J$1000,$A5,Mature!J$5:J$1000),\"\")","v":113674},{"$f":"IF(ISNUMBER($A5),SUMIF(Mature!$G$5:K$1000,$A5,Mature!K$5:K$1000),\"\")","v":93674},null,{"$f":"RIGHT(\"   \"&ROW(A5),3)&RIGHT(A$1&A5,7)&IF(B5=0,\"\",RIGHT(A$1&TEXT(B5,\"#,###,##0\"),B$1)&RIGHT(A$1&TEXT(C5,\"#,###,##0.00\"),C$1)&RIGHT(A$1&TEXT(D5,\"#,###,##0\"),D$1)&RIGHT(A$1&TEXT(E5,\"#,###,##0\"),E$1))","v":"  5   2028   20,000     98,256.00    113,674     93,674"}]
[{"$f":"IF(A5=\"\",\"\",IF(A5+1<=YEAR(MAX(Portfolio!A$5:A$1000))+30,A5+1,\"\"))","v":2029},{"$f":"IF(ISNUMBER($A6),SUMIF(Mature!$G$5:G$1000,$A6,Mature!B$5:B$1000),\"\")","v":20000},{"$f":"IF(ISNUMBER($A6),SUMIF(Mature!$G$5:I$1000,$A6,Mature!D$5:D$1000),\"\")","v":94236},{"$f":"IF(ISNUMBER($A6),SUMIF(Mature!$G$5:J$1000,$A6,Mature!J$5:J$1000),\"\")","v":115021},{"$f":"IF(ISNUMBER($A6),SUMIF(Mature!$G$5:K$1000,$A6,Mature!K$5:K$1000),\"\")","v":95021},null,"  6   2029   20,000     94,236.00    115,021     95,021"]
[{"$f":"IF(A6=\"\",\"\",IF(A6+1<=YEAR(MAX(Portfolio!A$5:A$1000))+30,A6+1,\"\"))","v":2030},{"$f":"IF(ISNUMBER($A7),SUMIF(Mature!$G$5:G$1000,$A7,Mature!B$5:B$1000),\"\")","v":20000},{"$f":"IF(ISNUMBER($A7),SUMIF(Mature!$G$5:I$1000,$A7,Mature!D$5:D$1000),\"\")","v":91752},{"$f":"IF(ISNUMBER($A7),SUMIF(Mature!$G$5:J$1000,$A7,Mature!J$5:J$1000),\"\")","v":118847},{"$f":"IF(ISNUMBER($A7),SUMIF(Mature!$G$5:K$1000,$A7,Mature!K$5:K$1000),\"\")","v":98847},null,"  7   2030   20,000     91,752.00    118,847     98,847"]
[{"$f":"IF(A7=\"\",\"\",IF(A7+1<=YEAR(MAX(Portfolio!A$5:A$1000))+30,A7+1,\"\"))","v":2031},{"$f":"IF(ISNUMBER($A8),SUMIF(Mature!$G$5:G$1000,$A8,Mature!B$5:B$1000),\"\")","v":20000},{"$f":"IF(ISNUMBER($A8),SUMIF(Mature!$G$5:I$1000,$A8,Mature!D$5:D$1000),\"\")","v":68508},{"$f":"IF(ISNUMBER($A8),SUMIF(Mature!$G$5:J$1000,$A8,Mature!J$5:J$1000),\"\")","v":88708},{"$f":"IF(ISNUMBER($A8),SUMIF(Mature!$G$5:K$1000,$A8,Mature!K$5:K$1000),\"\")","v":68708},null,"  8   2031   20,000     68,508.00     88,708     68,708"]
[{"$f":"IF(A8=\"\",\"\",IF(A8+1<=YEAR(MAX(Portfolio!A$5:A$1000))+30,A8+1,\"\"))","v":2032},{"$f":"IF(ISNUMBER($A9),SUMIF(Mature!$G$5:G$1000,$A9,Mature!B$5:B$1000),\"\")","v":20000},{"$f":"IF(ISNUMBER($A9),SUMIF(Mature!$G$5:I$1000,$A9,Mature!D$5:D$1000),\"\")","v":55512},{"$f":"IF(ISNUMBER($A9),SUMIF(Mature!$G$5:J$1000,$A9,Mature!J$5:J$1000),\"\")","v":71645},{"$f":"IF(ISNUMBER($A9),SUMIF(Mature!$G$5:K$1000,$A9,Mature!K$5:K$1000),\"\")","v":51645},null,"  9   2032   20,000     55,512.00     71,645     51,645"]
[{"$f":"IF(A9=\"\",\"\",IF(A9+1<=YEAR(MAX(Portfolio!A$5:A$1000))+30,A9+1,\"\"))","v":2033},{"$f":"IF(ISNUMBER($A10),SUMIF(Mature!$G$5:G$1000,$A10,Mature!B$5:B$1000),\"\")","v":20000},{"$f":"IF(ISNUMBER($A10),SUMIF(Mature!$G$5:I$1000,$A10,Mature!D$5:D$1000),\"\")","v":45884},{"$f":"IF(ISNUMBER($A10),SUMIF(Mature!$G$5:J$1000,$A10,Mature!J$5:J$1000),\"\")","v":58278},{"$f":"IF(ISNUMBER($A10),SUMIF(Mature!$G$5:K$1000,$A10,Mature!K$5:K$1000),\"\")","v":38278},null," 10   2033   20,000     45,884.00     58,278     38,278"]
[{"$f":"IF(A10=\"\",\"\",IF(A10+1<=YEAR(MAX(Portfolio!A$5:A$1000))+30,A10+1,\"\"))","v":2034},{"$f":"IF(ISNUMBER($A11),SUMIF(Mature!$G$5:G$1000,$A11,Mature!B$5:B$1000),\"\")","v":20000},{"$f":"IF(ISNUMBER($A11),SUMIF(Mature!$G$5:I$1000,$A11,Mature!D$5:D$1000),\"\")","v":43608},{"$f":"IF(ISNUMBER($A11),SUMIF(Mature!$G$5:J$1000,$A11,Mature!J$5:J$1000),\"\")","v":56634},{"$f":"IF(ISNUMBER($A11),SUMIF(Mature!$G$5:K$1000,$A11,Mature!K$5:K$1000),\"\")","v":36634},null," 11   2034   20,000     43,608.00     56,634     36,634"]
[{"$f":"IF(A11=\"\",\"\",IF(A11+1<=YEAR(MAX(Portfolio!A$5:A$1000))+30,A11+1,\"\"))","v":2035},{"$f":"IF(ISNUMBER($A12),SUMIF(Mature!$G$5:G$1000,$A12,Mature!B$5:B$1000),\"\")","v":20000},{"$f":"IF(ISNUMBER($A12),SUMIF(Mature!$G$5:I$1000,$A12,Mature!D$5:D$1000),\"\")","v":42808},{"$f":"IF(ISNUMBER($A12),SUMIF(Mature!$G$5:J$1000,$A12,Mature!J$5:J$1000),\"\")","v":57826},{"$f":"IF(ISNUMBER($A12),SUMIF(Mature!$G$5:K$1000,$A12,Mature!K$5:K$1000),\"\")","v":37826},null," 12   2035   20,000     42,808.00     57,826     37,826"]
[{"$f":"IF(A12=\"\",\"\",IF(A12+1<=YEAR(MAX(Portfolio!A$5:A$1000))+30,A12+1,\"\"))","v":2036},{"$f":"IF(ISNUMBER($A13),SUMIF(Mature!$G$5:G$1000,$A13,Mature!B$5:B$1000),\"\")","v":20000},{"$f":"IF(ISNUMBER($A13),SUMIF(Mature!$G$5:I$1000,$A13,Mature!D$5:D$1000),\"\")","v":42944},{"$f":"IF(ISNUMBER($A13),SUMIF(Mature!$G$5:J$1000,$A13,Mature!J$5:J$1000),\"\")","v":61767},{"$f":"IF(ISNUMBER($A13),SUMIF(Mature!$G$5:K$1000,$A13,Mature!K$5:K$1000),\"\")","v":41767},null," 13   2036   20,000     42,944.00     61,767     41,767"]
[{"$f":"IF(A13=\"\",\"\",IF(A13+1<=YEAR(MAX(Portfolio!A$5:A$1000))+30,A13+1,\"\"))","v":2037},{"$f":"IF(ISNUMBER($A14),SUMIF(Mature!$G$5:G$1000,$A14,Mature!B$5:B$1000),\"\")","v":20000},{"$f":"IF(ISNUMBER($A14),SUMIF(Mature!$G$5:I$1000,$A14,Mature!D$5:D$1000),\"\")","v":40300},{"$f":"IF(ISNUMBER($A14),SUMIF(Mature!$G$5:J$1000,$A14,Mature!J$5:J$1000),\"\")","v":58918},{"$f":"IF(ISNUMBER($A14),SUMIF(Mature!$G$5:K$1000,$A14,Mature!K$5:K$1000),\"\")","v":38918},null," 14   2037   20,000     40,300.00     58,918     38,918"]
[{"$f":"IF(A14=\"\",\"\",IF(A14+1<=YEAR(MAX(Portfolio!A$5:A$1000))+30,A14+1,\"\"))","v":2038},{"$f":"IF(ISNUMBER($A15),SUMIF(Mature!$G$5:G$1000,$A15,Mature!B$5:B$1000),\"\")","v":20000},{"$f":"IF(ISNUMBER($A15),SUMIF(Mature!$G$5:I$1000,$A15,Mature!D$5:D$1000),\"\")","v":33288},{"$f":"IF(ISNUMBER($A15),SUMIF(Mature!$G$5:J$1000,$A15,Mature!J$5:J$1000),\"\")","v":45061},{"$f":"IF(ISNUMBER($A15),SUMIF(Mature!$G$5:K$1000,$A15,Mature!K$5:K$1000),\"\")","v":25061},null," 15   2038   20,000     33,288.00     45,061     25,061"]
{"$rows_left_out":29}
{"sheet":"Notes","index":4,"n_rows":99,"n_cols":4,"rows_kept":99,"cut":false,"hidden":false,"merged":[]}
["2012-08-04","Prepared by Bob Hinkley"]
[null,"Excel workbook for computing the value of a portfolio of I Bonds."]
[null,"Compute for each of twelve months for a designated year."]
[null,"Use an Excel macro to compute and paste the values."]
[]
[null,"Instructions"]
[null,null,"Select the Portfolio sheet"]
[null,null,"Enter the date and amount of each I Bond purchase in columns A and B"]
[null,null,null,"(The day of the month doesn't affect the calculation)"]
[null,null,"Enter the year to display in cell C1"]
[null,null,"Click the [Calculate] button at the top left"]
[]
[null,"Comments"]
[null,null,"Total portfolio value displays in row 2"]
[null,null,"The Dec vs Dec column on the right shows the interest \"accrued\" for the year"]
{"$rows_left_out":84}